{"text_format":"1","workbook":"xlsx","n_sheets":6,"sheets":["DCF","Sheet1","Additional Data","Data","BBG_DATA","Help"],"not_rendered":{"charts":0,"images":8,"macros":1,"external_links":0,"defined_names":183,"comments":3,"pivot_tables":0},"unopened":[],"bounds":{"document_bytes":16777216,"sheet_cells":100000,"rows_first":2000,"rows_last":500,"rows_between":2000,"halvings":0,"cell_chars":16384,"cell_head_chars":4096},"cells_cut":0,"cells_raw":0,"read":"whole","date_system":"1900"}

{"sheet":"DCF","index":0,"n_rows":281,"n_cols":55,"rows_kept":281,"cut":false,"hidden":false,"merged":[[223,13,223,20],[246,13,246,20],[246,4,246,11],[26,13,26,16],[26,17,26,19],[44,10,45,10],[44,11,45,11],[44,12,45,12],[44,13,45,13],[44,14,45,14],[44,15,45,15],[46,6,46,9],[47,6,47,9],[221,4,221,20],[48,6,48,9],[249,13,249,14],[231,18,231,19],[248,13,248,14],[42,4,42,20],[25,13,25,16],[25,17,25,19],[25,5,25,8],[26,5,26,8],[25,9,25,11],[26,9,26,11],[231,9,231,10],[241,9,241,10],[243,9,243,10],[243,18,243,19],[241,18,241,19],[223,4,223,11],[5,10,5,11],[5,5,5,7],[7,5,7,7],[7,10,7,11],[11,4,11,20],[9,4,9,7],[7,13,7,14],[7,16,7,17],[7,19,7,20],[14,4,14,7],[22,5,22,11],[22,13,22,19],[23,5,23,8],[24,5,24,8],[23,13,23,16],[23,17,23,19],[24,13,24,16],[24,17,24,19],[23,9,23,11],[24,9,24,11]]}
[]
[]
[]
[]
[]
[null,null,null,null,"Ticker","BB CN",null,null,null,"Currency","Trading",null,null,{"$f":"IFERROR(IF(OR(_xll.BDP(TKR,\"EQY_FUND_IND\",\"Fill=B\")=\"Bank\",_xll.BDP(TKR,\"EQY_FUND_IND\",\"Fill=B\")=\"Financial\"),\"WARNING: This model is not suitable for financial institutions. See DDM<GO> or EQRV<GO>.\",VLOOKUP(_xll.BDP(TKR,\"MARKET_STATUS\",\"Fill=B\"),Data!$L$4:$N$58,3,FALSE)),\"\")","v":""}]
[]
[null,null,null,null,"Name",{"$f":"_xll.BDP(TKR,\"SECURITY_NAME\",\"Fill=B\")","v":"BlackBerry Ltd"},null,null,null,"Data","Adjusted (If available)",null,null,"Summary Analysis",null,null,"Input Calculation",null,null,"Output Analysis",null,null,{"$f":"_xll.BDP(\"EUR CURNCY\",\"TIME\")","v":"09:42:25"}]
[]
[null,null,null,null,{"$f":"\"In Millions of \"&CCY","v":"In Millions of CAD"},null,null,null,{"$f":"IF(ISBLANK(I52),\"\",I52)","v":"Févr 10 A"},{"$f":"IF(ISBLANK(J52),\"\",J52)","v":"Févr 11 A"},"Févr 12 A","Févr 13 A","Févr 14 A","Févr 15 A","Févr 16 E","Févr 17 E","Févr 18 E","Févr 19 E","Févr 20 E","Févr 21 E","Year 5"]
[]
[null,null,null,null,"Summary Analysis"]
[]
[]
[null,null,null,null,{"$f":"\"In Millions of \"&CCY","v":"In Millions of CAD"},null,null,null,{"$f":"IF(ISBLANK(I52),\"\",I52)","v":"Févr 10 A"},"Févr 11 A","Févr 12 A","Févr 13 A","Févr 14 A","Févr 15 A","Févr 16 E","Févr 17 E","Févr 18 E","Févr 19 E","Févr 20 E","Févr 21 E","Trend"]
[null,null,null,null,{"$f":"IF(ISBLANK(E55),\"\",E55)","v":"Revenue (Estimate Comparable)"},null,null,null,{"$f":"I55","v":16617.006847678778},20323.487484188721,18356.397527269932,11061.339286188208,7128.9817041387923,3754.077391876624,2855.1240000000003,2643.5450000000001,2216.8760000000002,1270.2047763770693,850.77257308939613,640.21121259181245]
[null,null,null,null,{"$f":"IF(ISBLANK(E57),\"\",E57)","v":"% YoY Growth"},null,null,null,{"$f":"IF(ISBLANK(I57),\"\",I57)","v":" "},{"$f":"J57","v":0.22305344581522513},{"$f":"K57","v":-9.6788996398829097E-2},-0.39741230436115349,-0.35550465276474896,-0.47340622438445001,-0.23946053797981148,-7.4105012601904607E-2,-0.16140031662029575,-0.42702939795592115,-0.33020833419001555,-0.24749429772162934]
[null,null,null,null,{"$f":"IF(ISBLANK(E211),\"\",E211)","v":"EBITDA"},null,null,null,{"$f":"I211","v":4461.9445506693537},5682.4499591598133,3471.3308485760081,1236.6962915470965,-2755.1165165121738,757.56944069954056,472.99699999999996,412.28999999999996,267.7510000000002,153.41345166790427,102.75505135030514,77.323762079011431]
[null,null,null,null,{"$f":"IF(ISBLANK(E212),\"\",E212)","v":"% Margin"},null,null,null,{"$f":"I212","v":0.26851674261015551},0.27960014065404126,0.18910741301059,0.11180348595683193,-0.38646704829003375,0.20179910044977509,0.16566600960238501,0.15596102960229538,0.12077851896091625,0.12077851896091626,0.12077851896091625,0.12077851896091629]
[null,null,null,null,{"$f":"RIGHT(E197,LEN(E197)-4)","v":"Free Cash Flow"},null,null,null,{"$f":"IF(ISBLANK(I197),\"\",I197)","v":1995.6442575622916},{"$f":"J197","v":3223.1448307989313},1988.6328930625273,1439.015077438303,-2088.8412390237368,1118.3856869984113,586.43261134081183,490.23184878071243,283.91353712534465,123.34150716450588,51.903083583984007,-3.6722382959892648]
{"$rows_left_out":262}
{"sheet":"Sheet1","index":1,"n_rows":64,"n_cols":103,"rows_kept":64,"cut":false,"hidden":true,"merged":[[32,16,32,23],[34,14,47,14]]}
[]
[]
[]
[]
[]
[]
[]
[]
[]
[]
[]
[]
[]
[]
[]
[]
[]
[]
[]
[]
{"$rows_left_out":45}
{"sheet":"Additional Data","index":2,"n_rows":55,"n_cols":12,"rows_kept":55,"cut":false,"hidden":false,"merged":[[6,1,6,12],[47,1,47,12],[8,5,8,6],[8,9,8,10],[40,4,40,5],[28,1,28,12],[41,4,41,5],[30,9,31,9],[30,10,31,10],[30,11,31,11],[30,2,31,2],[30,3,31,3],[30,4,31,5],[35,4,35,5],[36,4,36,5],[37,4,37,5],[38,4,38,5],[39,4,39,5],[10,4,10,11],[12,2,25,2],[32,4,32,5],[33,4,33,5],[34,4,34,5]]}
[]
[]
[]
[]
[]
[]
[null,"Perpetuity Growth Estimation"]
[]
[null,null,"Value",{"$f":"INDEX(E13:L26,MATCH($L$9,$D$13:$D$26,0),MATCH($H$9,$E$12:$L$12,0))","v":0.02},null,{"$f":"$E$11","v":"Discount rate"},null,{"$f":"IF(DCF!P47>E12,E12,IF(DCF!P47<L12,L12,ROUND(DCF!P47,2)))","v":0.12},null,{"$f":"$C$13","v":"Year 5 FCF Growth"},null,{"$f":"IF(DCF!T205>D13,D13,IF(DCF!T205<D26,D26,ROUND(DCF!T205,2)))","v":0.02}]
[]
[null,null,null,null,"Discount rate"]
[null,null,null,null,0.12,0.11,0.1,0.09,0.08,7.0000000000000007E-2,0.06,0.05]
[null,null,"Year 5 FCF Growth",0.15,6.2E-2,{"$f":"E13-($E13-$H13)/3","v":5.8999999999999997E-2},{"$f":"F13-($E13-$H13)/3","v":5.5999999999999994E-2},5.2999999999999999E-2,{"$f":"H13-($H13-$L13)/4","v":0.05},{"$f":"I13-($H13-$L13)/4","v":4.7E-2},{"$f":"J13-($H13-$L13)/4","v":4.3999999999999997E-2},4.1000000000000002E-2]
[null,null,null,0.14000000000000001,{"$f":"E13-(E$13-E$18)/5","v":5.9200000000000003E-2},5.6399999999999999E-2,5.3599999999999995E-2,5.0799999999999998E-2,4.8000000000000001E-2,4.5199999999999997E-2,4.24E-2,3.9600000000000003E-2]
[null,null,null,0.13,5.6400000000000006E-2,5.3800000000000001E-2,5.1199999999999996E-2,4.8599999999999997E-2,4.5999999999999999E-2,4.3399999999999994E-2,4.0800000000000003E-2,3.8200000000000005E-2]
[null,null,null,0.12,5.3600000000000009E-2,5.1200000000000002E-2,4.8799999999999996E-2,4.6399999999999997E-2,4.3999999999999997E-2,4.1599999999999991E-2,3.9200000000000006E-2,3.6800000000000006E-2]
[null,null,null,0.11,5.0800000000000012E-2,4.8600000000000004E-2,4.6399999999999997E-2,4.4199999999999996E-2,4.1999999999999996E-2,3.9799999999999988E-2,3.7600000000000008E-2,3.5400000000000008E-2]
[null,null,null,0.1,4.8000000000000001E-2,{"$f":"E18-($E18-$H18)/3","v":4.5999999999999999E-2},{"$f":"F18-($E18-$H18)/3","v":4.3999999999999997E-2},4.2000000000000003E-2,{"$f":"H18-($H18-$L18)/4","v":0.04},{"$f":"I18-($H18-$L18)/4","v":3.7999999999999999E-2},{"$f":"J18-($H18-$L18)/4","v":3.5999999999999997E-2},3.4000000000000002E-2]
[null,null,null,0.09,{"$f":"E18-(E$18-E$23)/5","v":4.48E-2},4.2999999999999997E-2,4.1200000000000001E-2,3.9400000000000004E-2,3.7650000000000003E-2,3.5900000000000001E-2,3.415E-2,3.2399999999999998E-2]
[null,null,null,0.08,4.1599999999999998E-2,3.9999999999999994E-2,3.8400000000000004E-2,3.6800000000000006E-2,3.5300000000000005E-2,3.3800000000000004E-2,3.2300000000000002E-2,3.0799999999999998E-2]
{"$rows_left_out":36}
{"sheet":"Data","index":3,"n_rows":58,"n_cols":14,"rows_kept":58,"cut":false,"hidden":true,"merged":[[1,1,1,2],[1,4,1,5]]}
[]
[null,"Currency Options",null,null,"Data Options",null,null,null,null,null,null,"Market Status"]
[null,"Choice",{"$f":"VLOOKUP(DCF!$K$6,Data!$B$4:$C$17,2,FALSE)","v":"CAD"},null,"Choice",{"$f":"VLOOKUP(DCF!K8,Data!E4:F5,2,FALSE)","v":"Y"},null,null,null,null,null,"PR286","Status","Message"]
[null,"Fundamental",{"$f":"_xll.BDP(TKR,\"EQY_FUND_CRNCY\",\"Fill=B\")","v":"USD"},null,"Adjusted (If available)","Y",null,null,null,null,null,"ACTV"," Active",{"$f":"\"\"","v":""}]
[null,"Trading",{"$f":"_xll.BDP(TKR,\"CRNCY\",\"Fill=B\")","v":"CAD"},null,"GAAP","N",null,null,null,null,null,"DLST"," Delisted",{"$f":"\"WARNING: This ticker is\"&M5","v":"WARNING: This ticker is Delisted"}]
[null,"AUD",{"$f":"B6","v":"AUD"},null,null,null,null,null,null,null,null,"ACQU"," Acquired",{"$f":"\"WARNING: This company's market status is\"&M6","v":"WARNING: This company's market status is Acquired"}]
[null,"BRL","BRL",null,"Adj Financials Available",{"$f":"_xll.BDP(TKR,\"ADJUSTED_FINANCIALS_INDICATOR\")","v":"Y"},null,null,null,null,null,"UNLS"," Unlisted",{"$f":"\"WARNING: This ticker is\"&M7","v":"WARNING: This ticker is Unlisted"}]
[null,"CAD",{"$f":"B8","v":"CAD"},null,null,null,null,null,null,null,null,"SUSP"," Suspended",{"$f":"\"WARNING: This ticker is\"&M8","v":"WARNING: This ticker is Suspended"}]
[null,"CHF","CHF",null,null,null,null,null,null,null,null,"HALT"," Halted",{"$f":"\"WARNING: This ticker is\"&M9","v":"WARNING: This ticker is Halted"}]
[null,"DKK","DKK",null,null,null,null,null,null,null,null,"PRIV"," Private Company",{"$f":"\"WARNING: This company's market status is\"&M10","v":"WARNING: This company's market status is Private Company"}]
[null,"EUR","EUR",null,null,null,null,null,null,null,null,"EXPD"," Expired",{"$f":"\"WARNING: This ticker is\"&M11","v":"WARNING: This ticker is Expired"}]
[null,"GBP","GBP",null,null,null,null,null,null,null,null,"POST"," Postponed",{"$f":"\"WARNING: This ticker is\"&M12","v":"WARNING: This ticker is Postponed"}]
[null,"JPY","JPY",null,null,null,null,null,null,null,null,"PEND"," Pending Listing",{"$f":"\"WARNING: This ticker is\"&M13","v":"WARNING: This ticker is Pending Listing"}]
[null,"NOK","NOK",null,null,null,null,null,null,null,null,"TKCH"," Ticker Change",{"$f":"\"WARNING: This ticker has changed. See DES<GO> or CACS<GO> for details.\"","v":"WARNING: This ticker has changed. See DES<GO> or CACS<GO> for details."}]
[null,"NZD","NZD",null,null,null,null,null,null,null,null,"LIQU"," Liquidated",{"$f":"\"WARNING: This company's market status is\"&M15","v":"WARNING: This company's market status is Liquidated"}]
[null,"SEK","SEK",null,null,null,null,null,null,null,null,"INAC"," Inactive",{"$f":"\"WARNING: This ticker is\"&M16","v":"WARNING: This ticker is Inactive"}]
[null,"USD","USD",null,null,null,null,null,null,null,null,"WHIS"," When Issued",{"$f":"\"WARNING: This ticker's market status is\"&M17","v":"WARNING: This ticker's market status is When Issued"}]
[null,null,null,null,null,null,null,null,null,null,null,"PSYM"," Pending Symbol","WARNING: This ticker's market status is Pending Symbol"]
[null,null,null,null,null,null,null,null,null,null,null,"OInd"," Opening Auction","WARNING: This ticker's market status is Opening Auction"]
[null,null,null,null,null,null,null,null,null,null,null,"CInd"," Closing Auction","WARNING: This ticker's market status is Closing Auction"]
{"$rows_left_out":39}
{"sheet":"BBG_DATA","index":4,"n_rows":35,"n_cols":7,"rows_kept":35,"cut":false,"hidden":true,"merged":[]}
[{"$f":"COUNTIF(3:100,\"#N/A Requesting Data...\")","v":0}]
[null,1,2,3,4,5,6]
["Best Sales",{"$f":"_xll.BDP(TKR,\"BEST_SALES\",\"BEST_FPERIOD_OVERRIDE\",B$2&\"FY\",\"EQY_FUND_CRNCY\",CCY)","v":2855.1240000000003},{"$f":"_xll.BDP(TKR,\"BEST_SALES\",\"BEST_FPERIOD_OVERRIDE\",C$2&\"FY\",\"EQY_FUND_CRNCY\",CCY)","v":2643.5450000000001},{"$f":"_xll.BDP(TKR,\"BEST_SALES\",\"BEST_FPERIOD_OVERRIDE\",D$2&\"FY\",\"EQY_FUND_CRNCY\",CCY)","v":2216.8760000000002},{"$f":"_xll.BDP(TKR,\"BEST_SALES\",\"BEST_FPERIOD_OVERRIDE\",E$2&\"FY\",\"EQY_FUND_CRNCY\",CCY)","v":"#N/A N/A"},{"$f":"_xll.BDP(TKR,\"BEST_SALES\",\"BEST_FPERIOD_OVERRIDE\",F$2&\"FY\",\"EQY_FUND_CRNCY\",CCY)","v":"#N/A N/A"},{"$f":"_xll.BDP(TKR,\"BEST_SALES\",\"BEST_FPERIOD_OVERRIDE\",G$2&\"FY\",\"EQY_FUND_CRNCY\",CCY)","v":"#N/A N/A"}]
["Best EPS LTG",{"$f":"_xll.BDP(TKR,\"BEST_EST_LONG_TERM_GROWTH\")","v":-20.402000000000001}]
["Best Gross Margin",{"$f":"_xll.BDP(TKR,\"BEST_GROSS_MARGIN\",\"BEST_FPERIOD_OVERRIDE\",B$2&\"FY\",\"EQY_FUND_CRNCY\",CCY)","v":45.280999999999999},{"$f":"_xll.BDP(TKR,\"BEST_GROSS_MARGIN\",\"BEST_FPERIOD_OVERRIDE\",C$2&\"FY\",\"EQY_FUND_CRNCY\",CCY)","v":45.204000000000001},{"$f":"_xll.BDP(TKR,\"BEST_GROSS_MARGIN\",\"BEST_FPERIOD_OVERRIDE\",D$2&\"FY\",\"EQY_FUND_CRNCY\",CCY)","v":60.207999999999998},{"$f":"_xll.BDP(TKR,\"BEST_GROSS_MARGIN\",\"BEST_FPERIOD_OVERRIDE\",E$2&\"FY\",\"EQY_FUND_CRNCY\",CCY)","v":"#N/A N/A"},{"$f":"_xll.BDP(TKR,\"BEST_GROSS_MARGIN\",\"BEST_FPERIOD_OVERRIDE\",F$2&\"FY\",\"EQY_FUND_CRNCY\",CCY)","v":"#N/A N/A"},{"$f":"_xll.BDP(TKR,\"BEST_GROSS_MARGIN\",\"BEST_FPERIOD_OVERRIDE\",G$2&\"FY\",\"EQY_FUND_CRNCY\",CCY)","v":"#N/A N/A"}]
["Best OPP",{"$f":"_xll.BDP(TKR,\"BEST_OPP\",\"BEST_FPERIOD_OVERRIDE\",B$2&\"FY\",\"EQY_FUND_CRNCY\",CCY)","v":-249.61799999999999},{"$f":"_xll.BDP(TKR,\"BEST_OPP\",\"BEST_FPERIOD_OVERRIDE\",C$2&\"FY\",\"EQY_FUND_CRNCY\",CCY)","v":-310.98099999999999},{"$f":"_xll.BDP(TKR,\"BEST_OPP\",\"BEST_FPERIOD_OVERRIDE\",D$2&\"FY\",\"EQY_FUND_CRNCY\",CCY)","v":-368.80700000000002},{"$f":"_xll.BDP(TKR,\"BEST_OPP\",\"BEST_FPERIOD_OVERRIDE\",E$2&\"FY\",\"EQY_FUND_CRNCY\",CCY)","v":"#N/A N/A"},{"$f":"_xll.BDP(TKR,\"BEST_OPP\",\"BEST_FPERIOD_OVERRIDE\",F$2&\"FY\",\"EQY_FUND_CRNCY\",CCY)","v":"#N/A N/A"},{"$f":"_xll.BDP(TKR,\"BEST_OPP\",\"BEST_FPERIOD_OVERRIDE\",G$2&\"FY\",\"EQY_FUND_CRNCY\",CCY)","v":"#N/A N/A"}]
["Best EBITDA",{"$f":"_xll.BDP(TKR,\"BEST_EBITDA\",\"BEST_FPERIOD_OVERRIDE\",B$2&\"FY\",\"EQY_FUND_CRNCY\",CCY)","v":472.99700000000001},{"$f":"_xll.BDP(TKR,\"BEST_EBITDA\",\"BEST_FPERIOD_OVERRIDE\",C$2&\"FY\",\"EQY_FUND_CRNCY\",CCY)","v":412.29},{"$f":"_xll.BDP(TKR,\"BEST_EBITDA\",\"BEST_FPERIOD_OVERRIDE\",D$2&\"FY\",\"EQY_FUND_CRNCY\",CCY)","v":267.75100000000003},{"$f":"_xll.BDP(TKR,\"BEST_EBITDA\",\"BEST_FPERIOD_OVERRIDE\",E$2&\"FY\",\"EQY_FUND_CRNCY\",CCY)","v":"#N/A N/A"},{"$f":"_xll.BDP(TKR,\"BEST_EBITDA\",\"BEST_FPERIOD_OVERRIDE\",F$2&\"FY\",\"EQY_FUND_CRNCY\",CCY)","v":"#N/A N/A"},{"$f":"_xll.BDP(TKR,\"BEST_EBITDA\",\"BEST_FPERIOD_OVERRIDE\",G$2&\"FY\",\"EQY_FUND_CRNCY\",CCY)","v":"#N/A N/A"}]
["Best CAPEX",{"$f":"_xll.BDP(TKR,\"BEST_CAPEX\",\"BEST_FPERIOD_OVERRIDE\",B$2&\"FY\",\"EQY_FUND_CRNCY\",CCY)","v":-77.807000000000002},{"$f":"_xll.BDP(TKR,\"BEST_CAPEX\",\"BEST_FPERIOD_OVERRIDE\",C$2&\"FY\",\"EQY_FUND_CRNCY\",CCY)","v":-130.47300000000001},{"$f":"_xll.BDP(TKR,\"BEST_CAPEX\",\"BEST_FPERIOD_OVERRIDE\",D$2&\"FY\",\"EQY_FUND_CRNCY\",CCY)","v":-191.809},{"$f":"_xll.BDP(TKR,\"BEST_CAPEX\",\"BEST_FPERIOD_OVERRIDE\",E$2&\"FY\",\"EQY_FUND_CRNCY\",CCY)","v":"#N/A N/A"},{"$f":"_xll.BDP(TKR,\"BEST_CAPEX\",\"BEST_FPERIOD_OVERRIDE\",F$2&\"FY\",\"EQY_FUND_CRNCY\",CCY)","v":"#N/A N/A"},{"$f":"_xll.BDP(TKR,\"BEST_CAPEX\",\"BEST_FPERIOD_OVERRIDE\",G$2&\"FY\",\"EQY_FUND_CRNCY\",CCY)","v":"#N/A N/A"}]
[]
[null,{"$f":"C10-1","v":-5},{"$f":"D10-1","v":-4},{"$f":"E10-1","v":-3},{"$f":"F10-1","v":-2},{"$f":"G10-1","v":-1},"-0"]
["IS_COMP_SALES",{"$f":"_xll.BDP(TKR,$A11,\"EQY_FUND_RELATIVE_PERIOD\",B$10&\"FY\",\"EQY_FUND_CRNCY\",CCY)","v":16617.006847678778},{"$f":"_xll.BDP(TKR,$A11,\"EQY_FUND_RELATIVE_PERIOD\",C$10&\"FY\",\"EQY_FUND_CRNCY\",CCY)","v":20323.487484188721},{"$f":"_xll.BDP(TKR,$A11,\"EQY_FUND_RELATIVE_PERIOD\",D$10&\"FY\",\"EQY_FUND_CRNCY\",CCY)","v":18356.397527269932},{"$f":"_xll.BDP(TKR,$A11,\"EQY_FUND_RELATIVE_PERIOD\",E$10&\"FY\",\"EQY_FUND_CRNCY\",CCY)","v":11061.339286188208},{"$f":"_xll.BDP(TKR,$A11,\"EQY_FUND_RELATIVE_PERIOD\",F$10&\"FY\",\"EQY_FUND_CRNCY\",CCY)","v":7128.9817041387923},{"$f":"_xll.BDP(TKR,$A11,\"EQY_FUND_RELATIVE_PERIOD\",G$10&\"FY\",\"EQY_FUND_CRNCY\",CCY)","v":3754.077391876624}]
["SALES_REV_TURN",{"$f":"_xll.BDP(TKR,$A12,\"EQY_FUND_RELATIVE_PERIOD\",B$10&\"FY\",\"EQY_FUND_CRNCY\",CCY)","v":16617.006847678778},{"$f":"_xll.BDP(TKR,$A12,\"EQY_FUND_RELATIVE_PERIOD\",C$10&\"FY\",\"EQY_FUND_CRNCY\",CCY)","v":20323.487484188721},{"$f":"_xll.BDP(TKR,$A12,\"EQY_FUND_RELATIVE_PERIOD\",D$10&\"FY\",\"EQY_FUND_CRNCY\",CCY)","v":18272.093778090228},{"$f":"_xll.BDP(TKR,$A12,\"EQY_FUND_RELATIVE_PERIOD\",E$10&\"FY\",\"EQY_FUND_CRNCY\",CCY)","v":11061.339286188208},{"$f":"_xll.BDP(TKR,$A12,\"EQY_FUND_RELATIVE_PERIOD\",F$10&\"FY\",\"EQY_FUND_CRNCY\",CCY)","v":7128.9817041387923},{"$f":"_xll.BDP(TKR,$A12,\"EQY_FUND_RELATIVE_PERIOD\",G$10&\"FY\",\"EQY_FUND_CRNCY\",CCY)","v":3754.077391876624}]
["GROSS_PROFIT",{"$f":"_xll.BDP(TKR,$A13,\"EQY_FUND_RELATIVE_PERIOD\",B$10&\"FY\",\"EQY_FUND_CRNCY\",CCY)","v":7316.8698074033091},{"$f":"_xll.BDP(TKR,$A13,\"EQY_FUND_RELATIVE_PERIOD\",C$10&\"FY\",\"EQY_FUND_CRNCY\",CCY)","v":9009.6336488654979},{"$f":"_xll.BDP(TKR,$A13,\"EQY_FUND_RELATIVE_PERIOD\",D$10&\"FY\",\"EQY_FUND_CRNCY\",CCY)","v":6521.1429512535015},{"$f":"_xll.BDP(TKR,$A13,\"EQY_FUND_RELATIVE_PERIOD\",E$10&\"FY\",\"EQY_FUND_CRNCY\",CCY)","v":3430.3837360038206},{"$f":"_xll.BDP(TKR,$A13,\"EQY_FUND_RELATIVE_PERIOD\",F$10&\"FY\",\"EQY_FUND_CRNCY\",CCY)","v":-44.994306954053734},{"$f":"_xll.BDP(TKR,$A13,\"EQY_FUND_RELATIVE_PERIOD\",G$10&\"FY\",\"EQY_FUND_CRNCY\",CCY)","v":1805.5592613403612}]
["IS_OPER_INC",{"$f":"_xll.BDP(TKR,$A14,\"EQY_FUND_RELATIVE_PERIOD\",B$10&\"FY\",\"EQY_FUND_CRNCY\",CCY)","v":3598.1342860839695},{"$f":"_xll.BDP(TKR,$A14,\"EQY_FUND_RELATIVE_PERIOD\",C$10&\"FY\",\"EQY_FUND_CRNCY\",CCY)","v":4732.9928154266781},{"$f":"_xll.BDP(TKR,$A14,\"EQY_FUND_RELATIVE_PERIOD\",D$10&\"FY\",\"EQY_FUND_CRNCY\",CCY)","v":1484.7377943766526},{"$f":"_xll.BDP(TKR,$A14,\"EQY_FUND_RELATIVE_PERIOD\",E$10&\"FY\",\"EQY_FUND_CRNCY\",CCY)","v":-1233.6994507759809},{"$f":"_xll.BDP(TKR,$A14,\"EQY_FUND_RELATIVE_PERIOD\",F$10&\"FY\",\"EQY_FUND_CRNCY\",CCY)","v":-7495.2144351601601},{"$f":"_xll.BDP(TKR,$A14,\"EQY_FUND_RELATIVE_PERIOD\",G$10&\"FY\",\"EQY_FUND_CRNCY\",CCY)","v":-476.15434385721488}]
["EFF_TAX_RATE",{"$f":"_xll.BDP(TKR,$A15,\"EQY_FUND_RELATIVE_PERIOD\",B$10&\"FY\",\"EQY_FUND_CRNCY\",CCY)","v":24.777698522276069},{"$f":"_xll.BDP(TKR,$A15,\"EQY_FUND_RELATIVE_PERIOD\",C$10&\"FY\",\"EQY_FUND_CRNCY\",CCY)","v":26.550387596899228},{"$f":"_xll.BDP(TKR,$A15,\"EQY_FUND_RELATIVE_PERIOD\",D$10&\"FY\",\"EQY_FUND_CRNCY\",CCY)","v":22.859025032938078},{"$f":"_xll.BDP(TKR,$A15,\"EQY_FUND_RELATIVE_PERIOD\",E$10&\"FY\",\"EQY_FUND_CRNCY\",CCY)","v":"#N/A N/A"},{"$f":"_xll.BDP(TKR,$A15,\"EQY_FUND_RELATIVE_PERIOD\",F$10&\"FY\",\"EQY_FUND_CRNCY\",CCY)","v":"#N/A N/A"},{"$f":"_xll.BDP(TKR,$A15,\"EQY_FUND_RELATIVE_PERIOD\",G$10&\"FY\",\"EQY_FUND_CRNCY\",CCY)","v":"#N/A N/A"}]
["CF_DEPR_AMORT",{"$f":"_xll.BDP(TKR,$A16,\"EQY_FUND_RELATIVE_PERIOD\",B$10&\"FY\",\"EQY_FUND_CRNCY\",CCY)","v":684.11858021887826},{"$f":"_xll.BDP(TKR,$A16,\"EQY_FUND_RELATIVE_PERIOD\",C$10&\"FY\",\"EQY_FUND_CRNCY\",CCY)","v":946.39437875335022},{"$f":"_xll.BDP(TKR,$A16,\"EQY_FUND_RELATIVE_PERIOD\",D$10&\"FY\",\"EQY_FUND_CRNCY\",CCY)","v":1510.5248235375032},{"$f":"_xll.BDP(TKR,$A16,\"EQY_FUND_RELATIVE_PERIOD\",E$10&\"FY\",\"EQY_FUND_CRNCY\",CCY)","v":1915.9801996666649},{"$f":"_xll.BDP(TKR,$A16,\"EQY_FUND_RELATIVE_PERIOD\",F$10&\"FY\",\"EQY_FUND_CRNCY\",CCY)","v":1328.9016239918194},{"$f":"_xll.BDP(TKR,$A16,\"EQY_FUND_RELATIVE_PERIOD\",G$10&\"FY\",\"EQY_FUND_CRNCY\",CCY)","v":781.20830883429596}]
["CF_CAP_EXPEND_PRPTY_ADD",{"$f":"_xll.BDP(TKR,$A17,\"EQY_FUND_RELATIVE_PERIOD\",B$10&\"FY\",\"EQY_FUND_CRNCY\",CCY)","v":-1121.7295069047666},{"$f":"_xll.BDP(TKR,$A17,\"EQY_FUND_RELATIVE_PERIOD\",C$10&\"FY\",\"EQY_FUND_CRNCY\",CCY)","v":-1060.7376046652976},{"$f":"_xll.BDP(TKR,$A17,\"EQY_FUND_RELATIVE_PERIOD\",D$10&\"FY\",\"EQY_FUND_CRNCY\",CCY)","v":-894.6115501187312},{"$f":"_xll.BDP(TKR,$A17,\"EQY_FUND_RELATIVE_PERIOD\",E$10&\"FY\",\"EQY_FUND_CRNCY\",CCY)","v":-417.55981410879355},{"$f":"_xll.BDP(TKR,$A17,\"EQY_FUND_RELATIVE_PERIOD\",F$10&\"FY\",\"EQY_FUND_CRNCY\",CCY)","v":-296.12532251156284},{"$f":"_xll.BDP(TKR,$A17,\"EQY_FUND_RELATIVE_PERIOD\",G$10&\"FY\",\"EQY_FUND_CRNCY\",CCY)","v":-97.932453701129319}]
["NET_WORKING_CAPITAL_INVESTMENT",{"$f":"_xll.BDP(TKR,$A18,\"EQY_FUND_RELATIVE_PERIOD\",B$10&\"FY\",\"EQY_FUND_CRNCY\",CCY)","v":275.65240259999985},{"$f":"_xll.BDP(TKR,$A18,\"EQY_FUND_RELATIVE_PERIOD\",C$10&\"FY\",\"EQY_FUND_CRNCY\",CCY)","v":262.37787800000001},{"$f":"_xll.BDP(TKR,$A18,\"EQY_FUND_RELATIVE_PERIOD\",D$10&\"FY\",\"EQY_FUND_CRNCY\",CCY)","v":169.0335},{"$f":"_xll.BDP(TKR,$A18,\"EQY_FUND_RELATIVE_PERIOD\",E$10&\"FY\",\"EQY_FUND_CRNCY\",CCY)","v":-597.3261},{"$f":"_xll.BDP(TKR,$A18,\"EQY_FUND_RELATIVE_PERIOD\",F$10&\"FY\",\"EQY_FUND_CRNCY\",CCY)","v":-1178.9283},{"$f":"_xll.BDP(TKR,$A18,\"EQY_FUND_RELATIVE_PERIOD\",G$10&\"FY\",\"EQY_FUND_CRNCY\",CCY)","v":-434.06229999999999}]
["IS_COGS_TO_FE_AND_PP_AND_G",{"$f":"_xll.BDP(TKR,$A19,\"EQY_FUND_RELATIVE_PERIOD\",B$10&\"FY\",\"EQY_FUND_CRNCY\",CCY)","v":9300.1370402754674},{"$f":"_xll.BDP(TKR,$A19,\"EQY_FUND_RELATIVE_PERIOD\",C$10&\"FY\",\"EQY_FUND_CRNCY\",CCY)","v":11313.853835323223},{"$f":"_xll.BDP(TKR,$A19,\"EQY_FUND_RELATIVE_PERIOD\",D$10&\"FY\",\"EQY_FUND_CRNCY\",CCY)","v":11750.950826836726},{"$f":"_xll.BDP(TKR,$A19,\"EQY_FUND_RELATIVE_PERIOD\",E$10&\"FY\",\"EQY_FUND_CRNCY\",CCY)","v":7630.9555501843879},{"$f":"_xll.BDP(TKR,$A19,\"EQY_FUND_RELATIVE_PERIOD\",F$10&\"FY\",\"EQY_FUND_CRNCY\",CCY)","v":7173.9760110928464},{"$f":"_xll.BDP(TKR,$A19,\"EQY_FUND_RELATIVE_PERIOD\",G$10&\"FY\",\"EQY_FUND_CRNCY\",CCY)","v":1948.5181305362623}]
[]
{"$rows_left_out":16}
{"sheet":"Help","index":5,"n_rows":178,"n_cols":8,"rows_kept":178,"cut":false,"hidden":false,"merged":[[220,20,228,23],[5,20,219,23],[220,1,228,19],[9,1,215,2],[9,18,215,19],[9,3,10,17],[5,3,8,17],[5,1,8,2],[5,18,8,19],[216,3,219,17],[216,1,219,2],[216,18,219,19]]}
[]
[]
[]
[]
[]
[]
[]
[]
[]
[null,null,null,"Application Objective: The Bloomberg Excel Discounted Cash Flow (XDCF) allows you to estimate the value of a stock based on the present value of projected free cash flows. "]
[]
[]
[null,null,null,"A. Step-by-step User Guide"]
[]
[null,null,null,"General color scheme:",null,null,null,"<-- User Input"]
[null,null,null,null,null,null,null,"<-- Forecast outlier"]
[null,null,null,null,null,null,null,"<-- Current selection (while forecasting future cash flows)"]
[]
[null,null,null,"Summary"]
[]
{"$rows_left_out":158}